{"text_format":"1","workbook":"xlsx","n_sheets":13,"sheets":["Данные заголовка","Приложение спецификации 1А","ЦC в работе","Формат SAP","Ценовые сегменты","Упаковка","Инталев","Юр. Лица","Группа расчета","Фин коды","NEGO","Ставки НДС","Дата"],"not_rendered":{"charts":0,"images":8,"macros":1,"external_links":2,"defined_names":18,"comments":1,"pivot_tables":0},"unopened":[],"bounds":{"document_bytes":16777216,"sheet_cells":100000,"rows_first":2000,"rows_last":500,"rows_between":2000,"halvings":0,"cell_chars":16384,"cell_head_chars":4096},"cells_cut":0,"cells_raw":0,"read":"whole","date_system":"1900"}

{"sheet":"Данные заголовка","index":0,"n_rows":2,"n_cols":9,"rows_kept":2,"cut":false,"hidden":false,"merged":[]}
["Фин код","сегментация ассортимента","Код контрагента","Дата действия спецификации","Дата окончания действия спецификации","Код основного пункта отгрузки Контрагента (на данный пункт отгрузки Покупатель формирует Заказ)","Коды вспомогательных пунктов отгрузки Контрагента","Версия шаблона","NEGO"]
[null,null,null,null,null,null,null,5]

{"sheet":"Приложение спецификации 1А","index":1,"n_rows":52,"n_cols":34,"rows_kept":52,"cut":false,"hidden":false,"merged":[[2,14,2,15],[18,25,18,35],[48,6,48,12],[48,1,48,5],[51,10,51,12],[49,2,50,2],[49,7,50,7],[51,1,51,3],[51,6,51,9],[51,4,51,5],[47,1,47,5],[47,6,47,12],[43,4,43,10],[26,3,26,10],[16,1,16,2],[13,1,13,2],[1,2,1,3],[1,8,1,9],[1,6,1,7],[8,1,8,2],[10,1,10,2],[3,5,3,6],[3,9,3,11],[9,1,9,2],[6,1,6,2],[7,1,7,2],[6,4,6,9],[7,4,7,9],[8,4,8,9],[9,4,9,9],[10,3,10,9],[16,3,16,9],[14,4,14,9],[14,1,14,2],[11,1,11,2],[12,1,12,2],[15,1,15,2],[11,3,11,9],[12,3,12,9],[13,3,13,9],[15,3,15,9]]}
[{"$f":"TODAY()","v":"2019-05-23"},null,null,null,null,null,null,null,null,null,null,null,null,"Версия шаблона:",6]
[null,null,"Наименование юр. лица Покупателя:",null,null,null,"Приложение №",null,"1 СПЕЦИФИКАЦИЯ (изменение цены)"]
[null,null,null,null,null,null,null,null,null,null,null,null,"NEGO",null,{"$f":"IF(N3=\"\", \"\",IF(N3=\"\",\"\",NEGO!B2))","v":""}]
[null,null,null,null,"к договору поставки","№"]
[null,null,null,null,null,null,null,null,null,null,null,null,null,null,null,null,null,null,null,null,null,null,null,null,0]
[null,null,null,null,null,null,"СПЕЦИФИКАЦИЯ"]
[null,"Финкод",null,null,{"$f":"IF(D7=\"\", \"\",IF(D7=\"A\", \"Товары спец акций\", VLOOKUP(D7,'Фин коды'!A:B,2,0)))","v":""}]
[null,"Сегментация ассортимента",null,null,{"$f":"IF(D8=\"\", \"\",VLOOKUP(D8,'Фин коды'!D:E,2,0))","v":""}]
[null,"Дата действия спецификации",null,null,{"$f":"IF(D9<$A$1,\"Дата приходится на прошлое\",\"\")","v":"Дата приходится на прошлое"}]
[null,"Дата окончания действия спецификации",null,null,{"$f":"IF(D10<$A$1,\"Дата приходится на прошлое\",\"\")","v":"Дата приходится на прошлое"}]
[null,"Код группы закупок"]
[null,"Код ссылочной закупочной организации"]
[null,"Код контрагента"]
[null,"Название контрагента"]
[null,"Код основного пункта отгрузки Контрагента (на данный пункт отгрузки Покупатель формирует Заказ)"]
[null,"Коды вспомогательных пунктов отгрузки Контрагента"]
[null,"Валюта цены"]
[]
[null,"1. Стороны пришли к соглашению и утвердили следующий перечень номенклатур и цены на них",null,null,null,null,null,null,null,null,null,null,null,null,null,null,null,null,null,null,null,null,null,null,null,"Вспомогательные столбцы"]
[null,"№п/п","Код номенклатуры контрагента","Код номенклатуры Х5 (PLU)","Наименование номенклатуры","Группа расчета","Вложение в короб (квант поставки в магазин)","Квант поставки на РЦ","GTIN упаковки","Признак упаковки (основная/дополнительная)","Ставка НДС, % (применяется ко всем ценам)","Цена при самовывозе, без НДС ","Цена при доставке поставщиком до РЦ, без НДС","Цена при доставке поставщиком до магазина, без НДС","Код GLN","Высота короба (мм) ","Вес короба (кг) ","Количество коробов в слое",null,null,null,null,null,null,null,null,"Комментарий к текущей цене","Текущая цена действующей спецификации, включая НДС","Процент (%) изменения цены товара, включая НДС","Отыграл ли рынок","Обоснование принятия цены"]
[null,1,2,3,4,5,6,7,8,9,10,11,12,13,14,15,16,17]
[null,1,null,null,null,null,null,null,null,null,null,null,null,null,null,null,null,null,null,null,null,null,null,null,null,{"$f":"ABS(J22+J22*I22%-K22)","v":0}]
[null,null,null,"Конец таблицы",null,null,null,null,null,null,null,null,null,null,null,null,null,null,null,null,null,null,null,null,null,{"$f":"ABS(J23+J23*I23%-K23)","v":0}]
[null,null,null,"Конец таблицы"]
[]
[null,null,null,null,null,null,null,null,null,null,null,"Цена при самовывозе, без НДС ","Цена при доставке поставщиком до РЦ, без НДС","Цена при доставке поставщиком до магазина, без НДС"]
[null,"2. Контрольная сумма",null,null,null,null,null,null,null,null,null,0,0,0]
[null,null,null,null,"\\сумма по столбцам 11,12,13 Цена без НДС\\"]
[]
[null,"3. Данный набор номенклатур и вышеуказанные цены действительны для следующих ценовых сегментов"]
["Начало","\\Необходимо отметить \"флажком\" ценовые сегменты, на которые распространяются условия данной спецификации"]
[null,"Центральный","Южный","Приволжский","Центрально-Черноземный","Средне-Волжский","Северо-Западный","Волго-Вятский","Уральский","Сибирский",null,null,null,null,null,null,null,null,null,null,null,null,null,null,null,"Центральный","Южный","Приволжский","Центрально-Черноземный","Средне-Волжский","Северо-Западный","Волго-Вятский","Уральский (Екатеринбург)","Сибирский"]
[null,"МОСКВА","КРАСНОДАР","УФА","ЛИПЕЦК","САМАРА","САНКТ-ПЕТЕРБУРГ","Н. НОВГОРОД","ЕКАТЕРИНБУРГ","НОВОСИБИРСК",null,null,null,null,null,null,null,null,null,null,null,null,null,null,null,false,false,false,false,false,false,false,false,false]
[null,"ВЛАДИМИР","ВОЛГОГРАД","КАЗАНЬ","ВОРОНЕЖ","ТОЛЬЯТТИ","АРХАНГЕЛЬСК","ИВАНОВО","ТЮМЕНЬ","ОМСК",null,null,null,null,null,null,null,null,null,null,null,null,null,null,null,false,false,false,false,false,false,false,false,false]
[null,"КОСТРОМА","РОСТОВ-НА-ДОНУ","ЗАКАМЬЕ","КУРСК","УЛЬЯНОВСК","МУРМАНСК","САРАНСК","СУРГУТ","КЕМЕРОВО",null,null,null,null,null,null,null,null,null,null,null,null,null,null,null,false,false,false,false,false,false,false,false,false]
[null,"ЯРОСЛАВЛЬ","НОВОРОССИЙСК","ВОЛЖСК","БЕЛГОРОД","САРАТОВ",null,"СЫКТЫВКАР","НИЖНЕВАРТОВСК","БАРНАУЛ",null,null,null,null,null,null,null,null,null,null,null,null,null,null,null,false,false,false,false,false,null,false,false,false]
[null,"ТВЕРЬ","СОЧИ","ИЖЕВСК","ОРЕЛ","ПЕНЗА",null,null,"ЧЕЛЯБИНСК","ТОМСК",null,null,null,null,null,null,null,null,null,null,null,null,null,null,null,false,false,false,false,false,null,null,false,false]
[null,"РЯЗАНЬ","АСТРАХАНЬ",null,"БРЯНСК","ОРЕНБУРГ",null,null,"ПЕРМЬ","КРАСНОЯРСК",null,null,null,null,null,null,null,null,null,null,null,null,null,null,null,false,false,null,false,false,null,null,false,false]
[null,"ТУЛА","СТАВРОПОЛЬ",null,"ТАМБОВ",null,null,null,"КУРГАН",null,null,null,null,null,null,null,null,null,null,null,null,null,null,null,null,false,false,null,false,null,null,null,false]
[null,"КАЛУГА",null,null,null,null,null,null,null,null,null,null,null,null,null,null,null,null,null,null,null,null,null,null,null,false]
[null,"СМОЛЕНСК",null,null,null,null,null,null,null,null,null,null,null,null,null,null,null,null,null,null,null,null,null,null,null,false]
[]
[null,null,null,"Sign"]
[null,null,null,null,"ПРОВЕРЕНО      _________________________________/______________________________________/*"]
[null,"*данная подпись подтверждает техническую проверку Спецификации, не является согласованием (подтверждением, утверждением) Спецификации со стороны Покупателя, не является акцептом/офертой Покупателя,  не создает для Покупателя никаких обязанностей, не влечет никаких юридических последствий для сторон."]
[]
[null,null,null,null,null,null,"ПОДПИСИ СТОРОН"]
[null,"  Поставщик",null,null,null,null,"  Покупатель"]
[]
[null,null,"мп",null,null,null,null,"мп"]
[]
[null,"  Дата предоставления Спецификации Покупателю",null,null,"\"_______\"______________________________20___г.",null,"  Дата рассмотрения Покупателем изменения Спецификации",null,null,null,"\"_______\"________________________20___г."]

{"sheet":"ЦC в работе","index":2,"n_rows":1,"n_cols":3,"rows_kept":1,"cut":false,"hidden":false,"merged":[]}
["Код ценового сегмента","Название ценового сегмента","Филиал"]

{"sheet":"Формат SAP","index":3,"n_rows":1,"n_cols":16,"rows_kept":1,"cut":false,"hidden":false,"merged":[]}
["Внешний код номенклатуры","Код номенклатуры","Группа расчета","Квант поставки","Ставка НДС","Доставка пост. до магазина, без НДС",null,"Квант РЦ","GLN-кодировка","Кол-во КорбВСлое, шт.","Высота слоя, мм","Вес упаковки, кг","GTIN","Признак упаковки","Дост. Пост. до РЦ, без НДС","Цена при самовывозе, без НДС"]

{"sheet":"Ценовые сегменты","index":4,"n_rows":55,"n_cols":3,"rows_kept":55,"cut":false,"hidden":true,"merged":[]}
["Код ценового сегмента","Название ценового сегмента","Филиал"]
["PS01","МОСКВА","Центральный"]
["PS02","САНКТ-ПЕТЕРБУРГ","Северо-Западный"]
["PS03","ВЛАДИМИР","Центральный"]
["PS04","Н. НОВГОРОД","Волго-Вятский"]
["PS05","ЕКАТЕРИНБУРГ","Уральский"]
["PS06","АРХАНГЕЛЬСК","Северо-Западный"]
["PS07","ЛИПЕЦК","Центрально-Черноземный"]
["PS08","САМАРА","Средне-Волжский"]
["PS09","УФА","Приволжский"]
["PS10","ВОРОНЕЖ","Центрально-Черноземный"]
["PS11","КУРСК","Центрально-Черноземный"]
["PS13","КОСТРОМА","Центральный"]
["PS14","ЯРОСЛАВЛЬ","Центральный"]
["PS15","КУРГАН","Уральский"]
["PS16","ТВЕРЬ","Центральный"]
["PS17","СУРГУТ","Уральский"]
["PS21","РЯЗАНЬ","Центральный"]
["PS22","СЫКТЫВКАР","Волго-Вятский"]
["PS25","ТОЛЬЯТТИ","Средне-Волжский"]
["PS27","УЛЬЯНОВСК","Средне-Волжский"]
["PS28","КАЗАНЬ","Приволжский"]
["PS29","ЗАКАМЬЕ","Приволжский"]
["PS30","ВОЛЖСК","Приволжский"]
["PS33","КРАСНОДАР","Южный"]
["PS34","ВОЛГОГРАД","Южный"]
["PS35","РОСТОВ-НА-ДОНУ","Южный"]
["PS36","СТАВРОПОЛЬ","Южный"]
["PS37","БЕЛГОРОД","Центрально-Черноземный"]
["PS38","ТЮМЕНЬ","Уральский"]
["PS39","САРАТОВ","Средне-Волжский"]
["PS41","ИЖЕВСК","Приволжский"]
["PS43","ПЕНЗА","Средне-Волжский"]
["PS44","НОВОРОССИЙСК","Южный"]
["PS45","ТАМБОВ","Центрально-Черноземный"]
["PS46","ТУЛА","Центральный"]
["PS47","КАЛУГА","Центральный"]
["PS48","ЧЕЛЯБИНСК","Уральский"]
["PS49","ПЕРМЬ","Уральский"]
["PS50","СОЧИ","Южный"]
["PS51","ОРЕЛ","Центрально-Черноземный"]
["PS52","БРЯНСК","Центрально-Черноземный"]
["PS53","ИВАНОВО","Волго-Вятский"]
["PS54","СМОЛЕНСК","Центральный"]
["PS55","ОРЕНБУРГ","Средне-Волжский"]
["PS56","АСТРАХАНЬ","Южный"]
["PS57","МУРМАНСК","Северо-Западный"]
["PS58","САРАНСК","Волго-Вятский"]
["PS59","НИЖНЕВАРТОВСК","Уральский"]
["PS60","НОВОСИБИРСК","Сибирский"]
["PS61","ОМСК","Сибирский"]
["PS62","КЕМЕРОВО","Сибирский"]
["PS63","БАРНАУЛ","Сибирский"]
["PS64","ТОМСК","Сибирский"]
["PS65","КРАСНОЯРСК","Сибирский"]

{"sheet":"Упаковка","index":5,"n_rows":2,"n_cols":1,"rows_kept":2,"cut":false,"hidden":true,"merged":[]}
["ОСН"]
["ДОП"]

{"sheet":"Инталев","index":6,"n_rows":18,"n_cols":6,"rows_kept":18,"cut":false,"hidden":false,"merged":[[4,1,13,1],[17,1,34,1]]}
[null,"Версия шаблона",{"$f":"'Приложение спецификации 1А'!O1","v":6}]
[null,"Финкод",null,null,"PLU","Наименование"]
[null,"Поставщик"]
[null,"Ценовые сегменты"]
[null,"Филиалы:"]
[]
[]
[]
[]
[]
[]
[]
[]
[]
[null,"Контрольная сумма",{"$f":"'Приложение спецификации 1А'!J28","v":0}]
[null,"Сегмент АК",{"$f":"IF('Приложение спецификации 1А'!D10=\"\",\"\",'Приложение спецификации 1А'!D10)","v":""}]
[null,"Кол-во юр.лиц",0]
[null,"Юр.лица"]

{"sheet":"Юр. Лица","index":7,"n_rows":57,"n_cols":21,"rows_kept":57,"cut":false,"hidden":true,"merged":[]}
[null,null,"ТД Перекресток ЗАО","Агроторг ООО","Агроаспект ООО","КОПЕЙКА-МОСКВА ООО","Копейка-М.О. ООО","АЛЬТЭКС ООО","Сладкая жизнь Н.Н. ООО","КОПЕЙКА-ПОВОЛЖЬЕ ООО","КОПЕЙКА-САРОВ ООО","КОПЕЙКА-ВОРОНЕЖ ООО","Купец ООО","ТД ЛАБАЗ ООО","Эпсилон ООО","ТД Рябина ООО","ТФ Самара-Продукт ООО","Фирма Омега-97 ООО","Элегия ООО","СтройИнвест ООО","Урал-Агро-Торг ООО"]
["PS01","МОСКВА","X","X","X","X","X","X","X",null,null,"X",null,"X","X","X",null,"X","X","X"]
["PS02","САНКТ-ПЕТЕРБУРГ","X","X"]
["PS03","ВЛАДИМИР","X","X","X","X",null,"X",null,"X",null,null,null,null,null,null,null,null,null,"X"]
["PS04","Н. НОВГОРОД",null,"X",null,null,null,null,"X","X","X"]
["PS05","ЕКАТЕРИНБУРГ","X","X"]
["PS06","АРХАНГЕЛЬСК","X","X"]
["PS07","ЛИПЕЦК","X","X",null,null,null,null,null,null,null,"X"]
["PS08","САМАРА","X","X",null,null,null,null,null,null,null,null,null,null,null,null,"X"]
["PS09","УФА","X","X"]
["PS10","ВОРОНЕЖ","X","X",null,null,null,null,null,null,null,"X"]
["PS11","КУРСК","X","X",null,null,null,null,null,null,null,"X"]
["PS13","КОСТРОМА","X","X",null,"X"]
["PS14","ЯРОСЛАВЛЬ","X","X","X","X","X"]
["PS15","КУРГАН","X","X"]
["PS16","ТВЕРЬ","X","X","X","X","X"]
["PS17","СУРГУТ",null,"X"]
["PS18","ВОЛОГДА",null,"X"]
["PS19","КАРЕЛИЯ",null,"X"]
["PS21","РЯЗАНЬ","X","X","X","X","X"]
["PS22","СЫКТЫВКАР",null,"X"]
["PS25","ТОЛЬЯТТИ","X","X",null,null,null,null,null,null,null,null,null,null,null,null,"X"]
["PS27","УЛЬЯНОВСК","X","X",null,null,null,null,null,null,null,null,null,null,null,null,"X"]
["PS28","КАЗАНЬ","X","X"]
["PS29","ЗАКАМЬЕ","X","X"]
["PS30","ВОЛЖСК","X","X"]
["PS33","КРАСНОДАР","X","X"]
["PS34","ВОЛГОГРАД","X","X"]
["PS35","РОСТОВ-НА-ДОНУ","X","X"]
["PS36","СТАВРОПОЛЬ","X","X"]
["PS37","БЕЛГОРОД","X","X",null,null,null,null,null,null,null,"X","X"]
["PS38","ТЮМЕНЬ","X","X"]
["PS39","САРАТОВ","X","X"]
["PS41","ИЖЕВСК","X","X"]
["PS43","ПЕНЗА","X","X"]
["PS44","НОВОРОССИЙСК","X","X"]
["PS45","ТАМБОВ","X","X",null,null,null,null,null,null,null,"X"]
["PS46","ТУЛА","X","X","X","X","X",null,null,null,null,"X",null,null,null,null,null,null,null,"X"]
["PS47","КАЛУГА","X","X","X","X","X",null,null,null,null,null,null,null,null,null,null,null,null,"X"]
["PS48","ЧЕЛЯБИНСК","X","X",null,null,null,null,null,null,null,null,null,null,null,null,null,null,null,null,"X"]
["PS49","ПЕРМЬ","X","X"]
["PS50","СОЧИ","X","X",null,null,null,null,null,null,null,null,null,null,null,null,null,"X"]
["PS51","ОРЕЛ","X","X",null,null,null,null,null,null,null,"X"]
["PS52","БРЯНСК",null,"X",null,"X"]
["PS53","ИВАНОВО","X","X",null,null,null,null,null,"X"]
["PS54","СМОЛЕНСК","X","X",null,"X"]
["PS55","ОРЕНБУРГ","X","X"]
["PS56","АСТРАХАНЬ",null,"X"]
["PS57","МУРМАНСК","X","X"]
["PS58","САРАНСК","X","X",null,null,null,null,"X","X","X"]
["PS59","НИЖНЕВАРТОВСК","X"]
["PS60","НОВОСИБИРСК","X"]
["PS61","ОМСК","X"]
["PS62","КЕМЕРОВО","X"]
["PS63","БАРНАУЛ","X"]
["PS64","ТОМСК","X"]
["PS65","КРАСНОЯРСК","X"]

{"sheet":"Группа расчета","index":8,"n_rows":157,"n_cols":1,"rows_kept":157,"cut":false,"hidden":true,"merged":[]}
["Группа расчета"]
["A"]
["AA"]
["AB"]
["AC"]
["AD"]
["AE"]
["AG"]
["AH"]
["AI"]
["AJ"]
["AK"]
["AN"]
["AP"]
["AR"]
["AS"]
["AT"]
["AU"]
["AW"]
["AX"]
["AY"]
["AZ"]
["B"]
["BB"]
["C"]
["CA"]
["CB"]
["CC"]
["CD"]
["CP"]
["D"]
["DA"]
["DB"]
["DC"]
["DD"]
["DE"]
["DF"]
["DG"]
["DH"]
["DI"]
["DJ"]
["DK"]
["DL"]
["DM"]
["DN"]
["DO"]
["DP"]
["DQ"]
["DR"]
["DS"]
["DT"]
["DU"]
["DV"]
["DW"]
["DX"]
["DY"]
["DZ"]
["E"]
["EA"]
["EB"]
["ED"]
["EF"]
["EG"]
["EH"]
["EI"]
["EJ"]
["EK"]
["EL"]
["EM"]
["EN"]
["EP"]
["EQ"]
["ER"]
["ES"]
["EW"]
["EZ"]
["F"]
["FA"]
["FC"]
["FF"]
["FV"]
["G"]
["GA"]
["GB"]
["GC"]
["GD"]
["GE"]
["GF"]
["GG"]
["GH"]
["GI"]
["GJ"]
["GK"]
["GL"]
["GM"]
["GN"]
["GO"]
["GP"]
["GQ"]
["GR"]
["GS"]
["GT"]
["GV"]
["GW"]
["GX"]
["GY"]
["H"]
["I"]
["J"]
["JA"]
["K"]
["KA"]
["KB"]
["KC"]
["KK"]
["L"]
["LA"]
["LB"]
["LC"]
["LD"]
["LF"]
["LG"]
["LH"]
["LI"]
["M"]
["N"]
["O"]
["P"]
["PA"]
["Q"]
["R"]
["RA"]
["RB"]
["S"]
["SA"]
["SB"]
["SC"]
["SD"]
["SE"]
["SF"]
["SG"]
["SS"]
["T"]
["TA"]
["TE"]
["U"]
["UF"]
["V"]
["VB"]
["VL"]
["W"]
["X"]
["XA"]
["XX"]
["Y"]
["Z"]
["ZG"]

{"sheet":"Фин коды","index":9,"n_rows":64,"n_cols":5,"rows_kept":64,"cut":false,"hidden":true,"merged":[]}
["№","Название",null,"№","Название"]
["AA","Товары для спецакции",null,10,"Товары первой цены"]
["C1","ФК_Бытовая химия",null,20,"Собственная торговая марка"]
["C2","ФК_Уборка, эксплуата",null,"30/40","Федеральные/локальные бренды"]
["C3","ФК_Красота,уход.воло",null,50,"ФРОВ ТС Пятерочка"]
["C4","ФК_Ср.ухода за телом",null,60,"ФРОВ ТС Карусель"]
["C5","ФК_Уход.кож.лица,гиг",null,70,"ЯЛ"]
["C6","ФК_Ватные средства"]
["D1","ФК_Газ.напитки,вода"]
["D2","ФК_Пиво,слабоалк.нап"]
["D3","ФК_Вино"]
["D4","ФК_Табак"]
["D5","ФК_Водка, ликеры"]
["D6","ФК_Соки, нектары"]
["D7","ФК_Коньяк,бренди,др."]
["F1","ФК_Овощи/Грибы"]
["F2","ФК_Овощи/Зелень"]
["F3","ФК_Фрукты/Ягоды"]
["F4","ФК_Фрукты/Экзотика"]
["G0","ФК_Пироги"]
["G1","ФК_Кофе,какао,шокола"]
["G2","ФК_Чай/ травы"]
["G3","ФК_Детское питание"]
["G4","ФК_Диаб.пит,мед,орех"]
["G5","ФК_Соусы,горчица,хре"]
["G6","ФК_Консервация"]
["G7","ФК_Злаки,сахар,соль,"]
["G8","ФК_Раст.масло,макаро"]
["G9","ФК_Шоколад, конфеты"]
["GI","ФК_Печенье,вафли,вып"]
["GJ","ФК_Вост.слад,чипсы,"]
["GK","ФК_Корма для животны"]
["N0","ФК_Посуда, декор"]
["N1","ФК_Сад и спорт"]
["N2","ФК_Тов.для дом.живот"]
["N3","ФК_Сезонные товары"]
["N4","ФК_ТВ,Медиа,Акссесуа"]
["N5","ФК_Текстиль для дома"]
["N6","ФК_Одежда"]
["N7","ФК_Тов.для ремон.DIY"]
["N8","ФК_Автомобиль.товары"]
["N9","ФК_Товары для дома"]
["NA","ФК_Детские товары"]
["NB","ФК_Бытовая техника"]
["NC","ФК_Пресса"]
["S0","ФК_Свежие торты"]
["S1","ФК_Мясная гастрономи"]
["S2","ФК_Хлеб, хлебоб.изд"]
["S3","ФК_Сыры"]
["S4","ФК_Яйца"]
["S5","ФК_Молоко"]
["S6","ФК_Мол/творож.продук"]
["S7","ФК_Майонез, маргарин"]
["S8","ФК_Заморозка"]
["S9","ФК_Готовая кулинария"]
["U1","ФК_Охлажд.рыбн.проду"]
["U2","ФК_Мясо,мясные проду"]
["U3","ФК_Птица"]
["U4","ФК_Фрукты и овощи"]
["P1","ФК_Мясо СП"]
["P2","ФК_Птица СП"]
["P3","ФК_Хлеб СП"]
["P4","ФК_Кулинария и салат"]
["P5","ФК_Рыба СП"]

{"sheet":"NEGO","index":10,"n_rows":2,"n_cols":2,"rows_kept":2,"cut":false,"hidden":true,"merged":[]}
["NEGO"]
["X","Переговорная кампания"]

{"sheet":"Ставки НДС","index":11,"n_rows":4,"n_cols":1,"rows_kept":4,"cut":false,"hidden":false,"merged":[]}
["Ставка НДС"]
[0]
[10]
[20]

{"sheet":"Дата","index":12,"n_rows":4,"n_cols":1,"rows_kept":4,"cut":false,"hidden":true,"merged":[]}
["Дата"]
[]
[{"$f":"TODAY()","v":"2019-05-23"}]
["9999-12-31"]