{"text_format":"1","workbook":"xlsx","n_sheets":13,"sheets":["Данные заголовка","Лист на акцию","Фин коды","Группа расчета","Ставки НДС","Ценовые сегменты","Юр. Лица","Торговая сеть","ЦC в работе","Формат SAP","Инталев","Дата","Тип контроля количества"],"not_rendered":{"charts":0,"images":7,"macros":1,"external_links":0,"defined_names":8,"comments":0,"pivot_tables":0},"unopened":[],"bounds":{"document_bytes":16777216,"sheet_cells":100000,"rows_first":2000,"rows_last":500,"rows_between":2000,"halvings":0,"cell_chars":16384,"cell_head_chars":4096},"cells_cut":0,"cells_raw":0,"read":"whole","date_system":"1900"}

{"sheet":"Данные заголовка","index":0,"n_rows":2,"n_cols":11,"rows_kept":2,"cut":false,"hidden":false,"merged":[]}
["Фин код","сегментация ассортимента","код поставщика","дата действия с","дата действия по","промо с","промо по","Формат","1-По поставленному","2-По заказанному","Версия шаблона"]
[null,null,null,null,null,null,null,null,null,null,6]

{"sheet":"Лист на акцию","index":1,"n_rows":53,"n_cols":27,"rows_kept":53,"cut":false,"hidden":false,"merged":[[18,26,18,36],[49,6,49,11],[49,1,49,5],[48,1,48,5],[48,6,48,11],[16,1,16,2],[16,3,16,4],[0,9,0,10],[13,3,13,4],[3,6,3,7],[3,9,3,11],[12,3,12,4],[2,6,2,7],[1,2,1,3],[10,1,10,2],[12,1,12,2],[13,1,13,2],[14,1,14,2],[15,1,15,2],[11,1,11,2]]}
[{"$f":"TODAY()","v":"2018-08-14"},null,null,null,null,null,null,null,null,"Приложение №",null,null,null,"Версия шаблона:","6"]
[null,null,"Наименование юр. лица Покупателя:"]
[null,null,null,"к договору",null,"№",null,null,"от","\"                      \"",null,"          201        г."]
[null,null,null,null,"\\вид договора\\",null,"\\регистрационный номер договора\\"]
[]
[null,null,null,null,null,null,"ЛИСТ НА АКЦИЮ"]
[null,null,null,null,null,null,"кратковременное локальное снижение закупочных цен на отдельные номенклатуры"]
[]
[null,null,null,"Название/номер промо-акции",null,null,"Период проведения промо-акции c",null,null,"по"]
[null,"Торговая сеть",null,{"$f":"IF(C10=\"\", \"\",VLOOKUP(C10,'Торговая сеть'!A:B,2,0))","v":""},"Тип контроля количества для промо","1-По поставленному"]
[null,"Финкод",null,null,{"$f":"IF(D11=\"\", \"\",VLOOKUP(D11,'Фин коды'!A2:B61,2,0))","v":""}]
[null,"Сегментация ассортимента",null,null,{"$f":"IF(D12=\"\", \"\",VLOOKUP(D12,'Фин коды'!D:E,2))","v":""}]
[null,"Код контрагента"]
[null,"Название контрагента"]
[null,"Дата начала действия специальных закупочных цен",null,null,{"$f":"IF(D15<$A$1,\"Дата приходится на прошлое\",\"\")","v":"Дата приходится на прошлое"}]
[null,"Дата окончания действия специальных закупочных цен",null,null,{"$f":"IF(D16<$A$1,\"Дата приходится на прошлое\",\"\")","v":"Дата приходится на прошлое"}]
[null,"Тип контроля входных цен (заказ/поставка)*"]
[null,"1.  Стороны пришли к соглашению и утвердили следующий перечень номенклатур со специальными ценами на них"]
[null,"\\По окончанию действия специальных закупочных цен дейстуют цены основной утвержденной с двух сторон спецификации\\",null,null,null,null,null,null,null,null,null,null,null,null,null,null,null,null,null,null,null,null,null,null,null,null,"Вспомогательные столбцы"]
[null,"№п/п","Код номенклатуры Х5 (PLU)","Наименование номенклатуры","Цена при самовывозе, без НДС","Цена  при доставке поставщиком до РЦ, без НДС","Цена  при доставке поставщиком до магазина, без НДС","Ставка НДС, % (применяется ко всем ценам)","Кол-во (шт/кг)"]
[null,1,2,3,4,5,6,7,8]
[null,1]
[null,2]
[null,null,"Конец таблицы","Конец таблицы"]
[null,null,"Конец таблицы","Конец таблицы"]
[]
[]
[null,"2. Контрольная сумма",null,null,null,null,0]
[null,null,null,null,"\\сумма по столбцу 6 Цена без НДС\\"]
[]
[null,"3.  Данный набор номенклатур и вышеуказанные цены действительны для всех объектов следующих ценовых сегментов вне зависимости от их формата и юридического лица, а также и места проведения самой промо-акции"]
["Начало","\\Необходимо отметить \"флажком\" ценовые сегменты, на которые распространяются акционные условия. В случае установкифлажка на уровне филиала, лист на акцию прогружается на все ценовые сегменты, входящие в состав филиала\\"]
[null,"Центральный","Южный","Приволжский","Центрально-Черноземный","Средне-Волжский","Северо-Западный","Волго-Вятский","Уральский","Сибирский",null,null,null,null,null,"Центральный","Южный","Приволжский","Центрально-Черноземный","Средне-Волжский","Северо-Западный","Волго-Вятский","Уральский","Сибирский"]
[null,"МОСКВА","КРАСНОДАР","УФА","ЛИПЕЦК","САМАРА","САНКТ-ПЕТЕРБУРГ","Н. НОВГОРОД","ЕКАТЕРИНБУРГ","НОВОСИБИРСК",null,null,null,null,null,false,false,false,false,false,false,false,false,false]
[null,"ВЛАДИМИР","ВОЛГОГРАД","КАЗАНЬ","ВОРОНЕЖ","ТОЛЬЯТТИ","АРХАНГЕЛЬСК","ИВАНОВО","ТЮМЕНЬ","ОМСК",null,null,null,null,null,false,false,false,false,false,false,false,false,false]
[null,"КОСТРОМА","РОСТОВ-НА-ДОНУ","ЗАКАМЬЕ","КУРСК","УЛЬЯНОВСК","МУРМАНСК","САРАНСК","СУРГУТ","КЕМЕРОВО",null,null,null,null,null,false,false,false,false,false,false,false,false,false]
[null,"ЯРОСЛАВЛЬ","НОВОРОССИЙСК","ВОЛЖСК","БЕЛГОРОД","САРАТОВ",null,"СЫКТЫВКАР","НИЖНЕВАРТОВСК","БАРНАУЛ",null,null,null,null,null,false,false,false,false,false,null,false,false,false]
[null,"ТВЕРЬ","СОЧИ","ИЖЕВСК","ОРЕЛ","ПЕНЗА",null,null,"ЧЕЛЯБИНСК","ТОМСК",null,null,null,null,null,false,false,false,false,false,null,null,false,false]
[null,"РЯЗАНЬ","АСТРАХАНЬ",null,"БРЯНСК","ОРЕНБУРГ",null,null,"ПЕРМЬ",null,null,null,null,null,null,false,false,null,false,false,null,null,false]
[null,"ТУЛА","СТАВРОПОЛЬ",null,"ТАМБОВ",null,null,null,"КУРГАН",null,null,null,null,null,null,false,false,null,false,null,null,null,false]
[null,"КАЛУГА",null,null,null,null,null,null,null,null,null,null,null,null,null,false]
[null,"СМОЛЕНСК",null,null,null,null,null,null,null,null,null,null,null,null,null,false]
[]
[]
[null,null,null,"Sign"]
[]
[null,null,null,null,null,null,"ПОДПИСИ СТОРОН"]
[]
[]
[]
[null,null,"мп",null,null,null,null,"мп"]
[]
[null,null,null,"\"_______\"______________________________20___г.",null,null,null,null,null,"\"_______\"________________________20___г."]

{"sheet":"Фин коды","index":2,"n_rows":61,"n_cols":5,"rows_kept":61,"cut":false,"hidden":true,"merged":[]}
["№","Название",null,"№","Название"]
["A","Товары спец акций",null,10,"Товары первой цены"]
["AA","Товары для спецакции",null,20,"Собственная торговая марка"]
["C1","Бытовая химия",null,"30/40","Федеральные/локальные бренды"]
["C2","Уборка и эксплуатация",null,50,"ФРОВ ТС Пятерочка"]
["C3","Красота и средства для волос",null,60,"ФРОВ ТС Карусель"]
["C4","Средства по уходу за телом",null,70,"ЯЛ"]
["C5","Средства по уходу за кожей лица"]
["C6","Целлюлоза и ватная продукция"]
["D1","Газированные фруктовые напитки"]
["D2","Пиво, слабоалкогольные напитки"]
["D3","Вино"]
["D4","Табачные изделия и аксессуары, пресса"]
["D5","Водка, ликеры"]
["D6","Соки, нектары"]
["D7","Коньяк, бренди, другие спиртные напитки"]
["F1","Овощи/Грибы"]
["F2","Овощи/Зелень"]
["F3","Фрукты/Ягоды"]
["F4","Фрукты/Экзотика"]
["G0","Торты"]
["G1","Кофе, какао, шоколад"]
["G2","Чай и травы"]
["G3","Корм для животных/детское питание"]
["G4","Диабетическое питание, мед, орехи, сухофрукты"]
["G5","Соусы, горчица, хрен, уксус, специи"]
["G6","Консервация"]
["G7","Крупы и зерновые, сахар, соль"]
["G8","Растительное масло, макаронные изделия"]
["G9","Шоколад, конфеты, смешанные сладости"]
["GI","Печенье,вафли, хлебобулочные изделия, пряники"]
["GJ","Восточные сладости, чипсы, картофельные чипсы"]
["GK","Корма для животных"]
["GL","Торты, пирожные с д.с.х"]
["N0","Товары для дома и декора"]
["N1","Сад и сезонные товары"]
["N2","Товары для животных"]
["N3","Сезонные товары"]
["N4","Электроника"]
["N5","Текстиль для дома"]
["N6","Одежда"]
["N7","Товары для дома и сделанные своими руками"]
["N8","Автомобильные"]
["N9","Дом и посуда"]
["NA","Товары для детей"]
["NB","Бытовая техника"]
["NC","Печатная продукция"]
["S0","Торты свежие"]
["S1","Колбасные изделия"]
["S2","Хлебобулочные изделия"]
["S3","Сыры"]
["S4","Яйца"]
["S5","Молоко"]
["S6","Молоко, творожные изделия"]
["S7","Майонез, маргарин(жирные и масляные продукты)"]
["S8","Заморожен.продукты"]
["S9","Готовая кулинария"]
["U1","Охлажденная рыба и рыбные продукты"]
["U2","Мясо и мясные продукты"]
["U3","Птица"]
["U4","Фрукты и овощи"]

{"sheet":"Группа расчета","index":3,"n_rows":157,"n_cols":1,"rows_kept":157,"cut":false,"hidden":true,"merged":[]}
["Группа расчета"]
["A"]
["AA"]
["AB"]
["AC"]
["AD"]
["AE"]
["AG"]
["AH"]
["AI"]
["AJ"]
["AK"]
["AN"]
["AP"]
["AR"]
["AS"]
["AT"]
["AU"]
["AW"]
["AX"]
["AY"]
["AZ"]
["B"]
["BB"]
["C"]
["CA"]
["CB"]
["CC"]
["CD"]
["CP"]
["D"]
["DA"]
["DB"]
["DC"]
["DD"]
["DE"]
["DF"]
["DG"]
["DH"]
["DI"]
["DJ"]
["DK"]
["DL"]
["DM"]
["DN"]
["DO"]
["DP"]
["DQ"]
["DR"]
["DS"]
["DT"]
["DU"]
["DV"]
["DW"]
["DX"]
["DY"]
["DZ"]
["E"]
["EA"]
["EB"]
["ED"]
["EF"]
["EG"]
["EH"]
["EI"]
["EJ"]
["EK"]
["EL"]
["EM"]
["EN"]
["EP"]
["EQ"]
["ER"]
["ES"]
["EW"]
["EZ"]
["F"]
["FA"]
["FC"]
["FF"]
["FV"]
["G"]
["GA"]
["GB"]
["GC"]
["GD"]
["GE"]
["GF"]
["GG"]
["GH"]
["GI"]
["GJ"]
["GK"]
["GL"]
["GM"]
["GN"]
["GO"]
["GP"]
["GQ"]
["GR"]
["GS"]
["GT"]
["GV"]
["GW"]
["GX"]
["GY"]
["H"]
["I"]
["J"]
["JA"]
["K"]
["KA"]
["KB"]
["KC"]
["KK"]
["L"]
["LA"]
["LB"]
["LC"]
["LD"]
["LF"]
["LG"]
["LH"]
["LI"]
["M"]
["N"]
["O"]
["P"]
["PA"]
["Q"]
["R"]
["RA"]
["RB"]
["S"]
["SA"]
["SB"]
["SC"]
["SD"]
["SE"]
["SF"]
["SG"]
["SS"]
["T"]
["TA"]
["TE"]
["U"]
["UF"]
["V"]
["VB"]
["VL"]
["W"]
["X"]
["XA"]
["XX"]
["Y"]
["Z"]
["ZG"]

{"sheet":"Ставки НДС","index":4,"n_rows":4,"n_cols":1,"rows_kept":4,"cut":false,"hidden":true,"merged":[]}
["Ставка НДС"]
[0]
[10]
[18]

{"sheet":"Ценовые сегменты","index":5,"n_rows":54,"n_cols":3,"rows_kept":54,"cut":false,"hidden":true,"merged":[]}
["Код ценового сегмента","Название ценового сегмента","Филиал"]
["PS01","МОСКВА","Центральный"]
["PS02","САНКТ-ПЕТЕРБУРГ","Северо-Западный"]
["PS03","ВЛАДИМИР","Центральный"]
["PS04","Н. НОВГОРОД","Волго-Вятский"]
["PS05","ЕКАТЕРИНБУРГ","Уральский"]
["PS06","АРХАНГЕЛЬСК","Северо-Западный"]
["PS07","ЛИПЕЦК","Центрально-Черноземный"]
["PS08","САМАРА","Средне-Волжский"]
["PS09","УФА","Приволжский"]
["PS10","ВОРОНЕЖ","Центрально-Черноземный"]
["PS11","КУРСК","Центрально-Черноземный"]
["PS13","КОСТРОМА","Центральный"]
["PS14","ЯРОСЛАВЛЬ","Центральный"]
["PS15","КУРГАН","Уральский"]
["PS16","ТВЕРЬ","Центральный"]
["PS17","СУРГУТ","Уральский"]
["PS21","РЯЗАНЬ","Центральный"]
["PS22","СЫКТЫВКАР","Волго-Вятский"]
["PS25","ТОЛЬЯТТИ","Средне-Волжский"]
["PS27","УЛЬЯНОВСК","Средне-Волжский"]
["PS28","КАЗАНЬ","Приволжский"]
["PS29","ЗАКАМЬЕ","Приволжский"]
["PS30","ВОЛЖСК","Приволжский"]
["PS33","КРАСНОДАР","Южный"]
["PS34","ВОЛГОГРАД","Южный"]
["PS35","РОСТОВ-НА-ДОНУ","Южный"]
["PS36","СТАВРОПОЛЬ","Южный"]
["PS37","БЕЛГОРОД","Центрально-Черноземный"]
["PS38","ТЮМЕНЬ","Уральский"]
["PS39","САРАТОВ","Средне-Волжский"]
["PS41","ИЖЕВСК","Приволжский"]
["PS43","ПЕНЗА","Средне-Волжский"]
["PS44","НОВОРОССИЙСК","Южный"]
["PS45","ТАМБОВ","Центрально-Черноземный"]
["PS46","ТУЛА","Центральный"]
["PS47","КАЛУГА","Центральный"]
["PS48","ЧЕЛЯБИНСК","Уральский"]
["PS49","ПЕРМЬ","Уральский"]
["PS50","СОЧИ","Южный"]
["PS51","ОРЕЛ","Центрально-Черноземный"]
["PS52","БРЯНСК","Центрально-Черноземный"]
["PS53","ИВАНОВО","Центральный"]
["PS54","СМОЛЕНСК","Центральный"]
["PS55","ОРЕНБУРГ","Средне-Волжский"]
["PS56","АСТРАХАНЬ","Южный"]
["PS57","МУРМАНСК","Северо-Западный"]
["PS58","САРАНСК","Волго-Вятский"]
["PS59","НИЖНЕВАРТОВСК","Уральский"]
["PS60","НОВОСИБИРСК","Сибирский"]
["PS61","ОМСК","Сибирский"]
["PS62","КЕМЕРОВО","Сибирский"]
["PS63","БАРНАУЛ","Сибирский"]
["PS64","ТОМСК","Сибирский"]

{"sheet":"Юр. Лица","index":6,"n_rows":56,"n_cols":21,"rows_kept":56,"cut":false,"hidden":true,"merged":[]}
[null,null,"ТД Перекресток ЗАО","Агроторг ООО","Агроаспект ООО","КОПЕЙКА-МОСКВА ООО","Копейка-М.О. ООО","АЛЬТЭКС ООО","Сладкая жизнь Н.Н. ООО","КОПЕЙКА-ПОВОЛЖЬЕ ООО","КОПЕЙКА-САРОВ ООО","КОПЕЙКА-ВОРОНЕЖ ООО","Купец ООО","ТД ЛАБАЗ ООО","Эпсилон ООО","ТД Рябина ООО","ТФ Самара-Продукт ООО","Фирма Омега-97 ООО","Элегия ООО","СтройИнвест ООО","Урал-Агро-Торг ООО"]
["PS01","МОСКВА","X",null,"X","X","X","X","X",null,null,"X",null,"X","X","X",null,"X","X","X"]
["PS02","САНКТ-ПЕТЕРБУРГ","X","X"]
["PS03","ВЛАДИМИР","X",null,"X","X",null,"X",null,"X",null,null,null,null,null,null,null,null,null,"X"]
["PS04","Н. НОВГОРОД",null,null,null,null,null,null,"X","X","X"]
["PS05","ЕКАТЕРИНБУРГ","X"]
["PS06","АРХАНГЕЛЬСК","X"]
["PS07","ЛИПЕЦК","X",null,null,null,null,null,null,null,null,"X"]
["PS08","САМАРА","X","X",null,null,null,null,null,null,null,null,null,null,null,null,"X"]
["PS09","УФА","X"]
["PS10","ВОРОНЕЖ","X",null,null,null,null,null,null,null,null,"X"]
["PS11","КУРСК","X",null,null,null,null,null,null,null,null,"X"]
["PS13","КОСТРОМА","X",null,null,"X"]
["PS14","ЯРОСЛАВЛЬ","X",null,"X","X","X"]
["PS15","КУРГАН","X"]
["PS16","ТВЕРЬ","X",null,"X","X","X"]
["PS17","СУРГУТ"]
["PS18","ВОЛОГДА"]
["PS19","КАРЕЛИЯ"]
["PS21","РЯЗАНЬ","X",null,"X","X","X"]
["PS22","СЫКТЫВКАР",null,"X"]
["PS25","ТОЛЬЯТТИ","X","X",null,null,null,null,null,null,null,null,null,null,null,null,"X"]
["PS27","УЛЬЯНОВСК","X",null,null,null,null,null,null,null,null,null,null,null,null,null,"X"]
["PS28","КАЗАНЬ","X","X"]
["PS29","ЗАКАМЬЕ","X","X"]
["PS30","ВОЛЖСК","X"]
["PS33","КРАСНОДАР","X"]
["PS34","ВОЛГОГРАД","X"]
["PS35","РОСТОВ-НА-ДОНУ","X"]
["PS36","СТАВРОПОЛЬ","X"]
["PS37","БЕЛГОРОД","X",null,null,null,null,null,null,null,null,"X","X"]
["PS38","ТЮМЕНЬ","X"]
["PS39","САРАТОВ","X","X"]
["PS41","ИЖЕВСК","X"]
["PS43","ПЕНЗА","X","X"]
["PS44","НОВОРОССИЙСК","X"]
["PS45","ТАМБОВ","X",null,null,null,null,null,null,null,null,"X"]
["PS46","ТУЛА","X",null,"X","X","X",null,null,null,null,"X",null,null,null,null,null,null,null,"X"]
["PS47","КАЛУГА","X",null,"X","X","X",null,null,null,null,null,null,null,null,null,null,null,null,"X"]
["PS48","ЧЕЛЯБИНСК","X",null,null,null,null,null,null,null,null,null,null,null,null,null,null,null,null,null,"X"]
["PS49","ПЕРМЬ","X"]
["PS50","СОЧИ","X",null,null,null,null,null,null,null,null,null,null,null,null,null,null,"X"]
["PS51","ОРЕЛ","X",null,null,null,null,null,null,null,null,"X"]
["PS52","БРЯНСК",null,null,null,"X"]
["PS53","ИВАНОВО","X",null,null,null,null,null,null,"X"]
["PS54","СМОЛЕНСК","X",null,null,"X"]
["PS55","ОРЕНБУРГ","X"]
["PS56","АСТРАХАНЬ"]
["PS57","МУРМАНСК","X","X"]
["PS58","САРАНСК","X",null,null,null,null,null,"X","X","X"]
["PS59","НИЖНЕВАРТОВСК","X"]
["PS60","НОВОСИБИРСК","X"]
["PS61","ОМСК","X"]
["PS62","КЕМЕРОВО","X"]
["PS63","БАРНАУЛ","X"]
["PS64","ТОМСК","X"]

{"sheet":"Торговая сеть","index":7,"n_rows":3,"n_cols":2,"rows_kept":3,"cut":false,"hidden":true,"merged":[]}
["H","Карусель"]
["S","Перекресток"]
["D","Пятерочка"]

{"sheet":"ЦC в работе","index":8,"n_rows":1,"n_cols":3,"rows_kept":1,"cut":false,"hidden":false,"merged":[]}
["Код ценового сегмента","Название ценового сегмента","Филиал"]

{"sheet":"Формат SAP","index":9,"n_rows":1,"n_cols":5,"rows_kept":1,"cut":false,"hidden":false,"merged":[]}
["Код номенклатуры","Цена  при доставке поставщиком до магазина, без НДС","Кол-во для ПРОМО (шт/кг)","Цена при самовывозе, без НДС","Цена  при доставке поставщиком до РЦ, без НДС"]

{"sheet":"Инталев","index":10,"n_rows":18,"n_cols":6,"rows_kept":18,"cut":false,"hidden":false,"merged":[[4,1,13,1],[17,1,34,1]]}
[null,"Версия шаблона:",{"$f":"'Лист на акцию'!O1","v":"6"}]
[null,"Финкод",{"$f":"IF('Лист на акцию'!D11=\"\",\"\",'Лист на акцию'!D11)","v":""},null,"PLU","Наименование"]
[null,"Поставщик",{"$f":"IF('Лист на акцию'!D14=\"\",\"\",'Лист на акцию'!D14)","v":""}]
[null,"Ценовые сегменты"]
[null,"Филиалы:"]
[]
[]
[]
[]
[]
[]
[]
[]
[]
[null,"Контрольная сумма",{"$f":"'Лист на акцию'!G28","v":0}]
[null,"Сегмент АК",{"$f":"IF('Лист на акцию'!D12=\"\",\"\",'Лист на акцию'!D12)","v":""}]
[null,"Кол-во юр.лиц",0]
[null,"Юр.лица"]

{"sheet":"Дата","index":11,"n_rows":4,"n_cols":1,"rows_kept":4,"cut":false,"hidden":true,"merged":[]}
["Дата"]
[]
[{"$f":"TODAY()","v":"2018-08-14"}]
["9999-12-31"]

{"sheet":"Тип контроля количества","index":12,"n_rows":2,"n_cols":1,"rows_kept":2,"cut":false,"hidden":true,"merged":[]}
["1-По поставленному"]
["2-По заказанному"]